** Generated by Mecway 28
*NODE
*ELEMENT,TYPE=B31
*NSET,NSET=TRANSF_NODES
*NSET,NSET=Y_AXIS_NODES._NEW_5
*NSET,NSET=X_AXIS_NODES._NEW_4
*NSET,NSET=Z_AXIS_NODES._NEW_6
*ELSET,ELSET=EALL
*ELSET,ELSET=BEAM_SECTION
*ELSET,ELSET=COMPONENT
*MATERIAL,NAME=MATERIAL
*ELASTIC,TYPE=ISOTROPIC
200000000000,0.3
*BEAM SECTION,ELSET=BEAM_SECTION,MATERIAL=MATERIAL,SECTION=RECT
0.2,0.1
0,0,1
*BEAM SECTION,ELSET=COMPONENT,MATERIAL=MATERIAL,SECTION=RECT
0.2,0.1
0.7071067811865,0.7071067811865,1
*BOUNDARY
2,1,,0
2,2,,0
2,3,,0
2,4,,0
2,5,,0
2,6,,0
3,1,,0
3,2,,0
*AMPLITUDE,NAME=AyM_1
0,0
1,100000
*TRANSFORM,NSET=TRANSF_NODES,TYPE=R
*STEP
*STATIC,SOLVER=Pardiso
*NODE FILE,GLOBAL=YES,OUTPUT=2D
U,RF
*EL FILE
S,NOE,E,ENER
*CLOAD
**,AMPLITUDE=AyM_1
1,5,100000
4,6,100000
1,6,100000
4,5,100000
*END STEP