** Generated by Mecway 28
*NODE
*ELEMENT,TYPE=D
*NSET,NSET=TEMP_WATER_INLET
*NSET,NSET=WATTER_NODES
*NSET,NSET=TEMPERATURE_NODES
*ELSET,ELSET=WATTER_ELEM
*MATERIAL,NAME=WATTER_PRODUCT
*DENSITY
1000
*CONDUCTIVITY,TYPE=ISO
10000,0
*SPECIFIC HEAT
4178,0
*FLUID CONSTANTS
*FLUID SECTION,ELSET=WATTER_ELEM,MATERIAL=WATTER_PRODUCT
*AMPLITUDE,NAME=A_1
0,373.15
1,473.15
*INITIAL CONDITIONS,TYPE=TEMPERATURE
TEMPERATURE_NODES,373.15
*MATERIAL,NAME=DUMMY_THERMAL
*DENSITY
1,0
*CONDUCTIVITY,TYPE=ISO
1,0
*SPECIFIC HEAT
4178,0
*FLUID CONSTANTS
*AMPLITUDE,NAME=A_2
0,0
1,1
*NSET,NSET=WATTER_Nodes
**10,7,4,2,11,8
*STEP,INC=1000,AMPLITUDE=STEP
*HEAT TRANSFER
0.001,1,0,0.1
*BOUNDARY
TEMP_WATER_INLET,11,,1
*NODE FILE,GLOBAL=YES
NT
*BOUNDARY,Amplitude=A_2
WATTER_Nodes,1,,-1
*NODE FILE
MF
*END STEP