** Generated by Mecway 16.0
*NODE
*ELEMENT,TYPE=B32
*ELEMENT,TYPE=B31
*NSET,NSET=pinned_support_nodes
*NSET,NSET=pinned_support_nodes(2)
*NSET,NSET=node_rotation_nodes
*NSET,NSET=force_nodes
*ELSET,ELSET=Reference
*ELSET,ELSET=Eall
*ELSET,ELSET=Lower_Flange
*ELSET,ELSET=Upper_Flange
*ELSET,ELSET=Web
*ELSET,ELSET=1
*ELSET,ELSET=2
*ELSET,ELSET=3
*ELSET,ELSET=4
*SURFACE,NAME=Face_Selection
20,S1
20,S2
20,S3
20,S5
19,S1
19,S2
19,S3
19,S5
18,S1
18,S2
18,S3
18,S5
17,S1
17,S2
17,S3
17,S5
16,S1
16,S2
16,S3
16,S5
** ... 12 like lines cut
*MATERIAL,NAME=Flange_82_x_7.4
*ELASTIC,TYPE=ISOTROPIC
210000000000,0
*DENSITY
7850
*MATERIAL,NAME=Web_145.2_x_5
*ELASTIC,TYPE=ISOTROPIC
210000000000,0
*DENSITY
7850
*MATERIAL,NAME=Material
*ELASTIC,TYPE=ISOTROPIC
1000000000,0
*BOUNDARY
1,4,,0
2,4,,0
3,4,,0
4,4,,0
5,4,,0
6,4,,0
7,4,,0
8,4,,0
*BOUNDARY
1,1,,0
1,2,,0
1,3,,0
*BOUNDARY
2,1,,0
2,2,,0
2,3,,0
*BEAM SECTION,ELSET=Lower_Flange,MATERIAL=Flange_82_x_7.4,SECTION=RECT,OFFSET2=10.3108
0.082,0.0074
0,1,0
*BEAM SECTION,ELSET=Upper_Flange,MATERIAL=Flange_82_x_7.4,SECTION=RECT,OFFSET2=-10.3108
0.082,0.0074
0,1,0
*BEAM SECTION,ELSET=Web,MATERIAL=Web_145.2_x_5,SECTION=RECT
0.1452,0.005
0,0,1
*BEAM SECTION,ELSET=Reference,MATERIAL=Material,SECTION=RECT
0.001,0.001
1,0,0
*STEP
*STATIC
*CLOAD
3,3,-10000
*NODE FILE,GLOBAL=YES
U
*EL FILE
S
*END STEP