** Generated by Mecway 14.0
*NODE
*ELEMENT,TYPE=C3D8
*ELSET,ELSET=element_orientation_elements
*SURFACE,NAME=pressure_faces
1,S2
*ORIENTATION,NAME=O1
*MATERIAL,NAME=Core
*ELASTIC,TYPE=ENGINEERINGCONSTANTS
1,2,3,0.1,0.1,0.2,4,6
5
*DENSITY
1580
*SOLID SECTION,ELSET=element_orientation_elements,MATERIAL=Core,ORIENTATION=O1
*BOUNDARY
1,1,,0
1,2,,0
1,3,,0
2,1,,0
2,2,,0
2,3,,0
3,1,,0
3,2,,0
*STEP
*STATIC
*DSLOAD
pressure_faces,P,1
*NODE FILE,GLOBAL=YES
U
*EL FILE
S
*END STEP