** Generated by Mecway 18.0
*NODE
*ELEMENT,TYPE=B31
*NSET,NSET=Force
*NSET,NSET=Constraint
*ELSET,ELSET=Beam
*MATERIAL,NAME=Material
*ELASTIC,TYPE=ISOTROPIC
210000000000,0.3
*BEAM SECTION,ELSET=Beam,MATERIAL=Material,SECTION=RECT
0.001,0.001
0,1,0
*BOUNDARY
1,1,,0
1,2,,0
1,3,,0
1,4,,0
1,5,,0
1,6,,0
*STEP
*STATIC
*CLOAD
2,2,1
*NODE FILE,GLOBAL=YES
U
*END STEP