** Generated by Mecway 7.0
*NODE
*ELEMENT,TYPE=C3D20
*NSET,NSET=Fixed
*NSET,NSET=displacement_nodes
*NSET,NSET=displacement_nodes(2)
*ELSET,ELSET=Default
*MATERIAL,NAME=Material
*ELASTIC,TYPE=ISOTROPIC
210000000000,0.3
*PLASTIC,HARDENING=ISOTROPIC
355000000,0
356000000,1000
*SOLID SECTION,ELSET=Default,MATERIAL=Material
*BOUNDARY
1,1,,0
1,2,,0
1,3,,0
2,1,,0
2,2,,0
2,3,,0
3,1,,0
3,2,,0
*AMPLITUDE,NAME=Aconstant
0,1
*AMPLITUDE,NAME=A_0A972AF97FAD
0,0
1,0.05
*STEP,NLGEOM=YES,INC=100
*STATIC
0.1,1
*BOUNDARY,AMPLITUDE=A_0A972AF97FAD
24,2,,0.707
*BOUNDARY,AMPLITUDE=A_0A972AF97FAD
44,2,,0.707
*BOUNDARY,AMPLITUDE=A_0A972AF97FAD
64,2,,0.707
*BOUNDARY,AMPLITUDE=A_0A972AF97FAD
84,2,,0.707
**Added displacement X direction
*BOUNDARY,AMPLITUDE=A_0A972AF97FAD
24,1,,0.707
*BOUNDARY,AMPLITUDE=A_0A972AF97FAD
44,1,,0.707
*BOUNDARY,AMPLITUDE=A_0A972AF97FAD
64,1,,0.707
*BOUNDARY,AMPLITUDE=A_0A972AF97FAD
84,1,,0.707
*NODE FILE,GLOBAL=YES
U,RF
*EL FILE
S,E,PEEQ
*Node Print, NSET=Fixed, TOTALS=ONLY, GLOBAL=NO
RF
*END STEP