** Generated by Mecway 6.0
*NODE
*ELEMENT,TYPE=C3D8
*ELSET,ELSET=Default
*MATERIAL,NAME=Material
*ELASTIC,TYPE=ISOTROPIC
1000000000,0.3
*SOLID SECTION,ELSET=Default,MATERIAL=Material
*BOUNDARY
5,1,,0
5,2,,0
5,3,,0
6,1,,0
6,2,,0
6,3,,0
7,1,,0
7,2,,0
*AMPLITUDE,NAME=Aconstant
0,1
*AMPLITUDE,NAME=A_3BA7CFCE3FB3
0,0
0.5,1.5
1,3
*STEP,NLGEOM=YES,INC=100
*STATIC,DIRECT
0.8, 0.8
*DLOAD,AMPLITUDE=A_3BA7CFCE3FB3
1,P1,1
*NODE FILE,GLOBAL=YES
U,RF
*EL FILE
S,E
*END STEP
*STEP,NLGEOM=YES,INC=100
*STATIC,DIRECT
0.01,0.1
*DLOAD,AMPLITUDE=A_3BA7CFCE3FB3,TIME DELAY=-0.8
1,P1,1
*NODE FILE,GLOBAL=YES
U,RF
*EL FILE
S,E
*END STEP